Target
DNA dC->dU-editing enzyme APOBEC-3A
Ligand
BDBM80394
Substrate
Meas. Tech.
Dose Response confirmation of small molecule APOBEC3A DNA Deaminase Inhibitors via a fluorescence-based single-stranded DNA deaminase assay
Temperature
298.15±n/a K
IC50
1890±n/a nM
Comments
extracted
Citation
 PubChem, PC Dose Response confirmation of small molecule APOBEC3A DNA Deaminase Inhibitors via a fluorescence-based single-stranded DNA deaminase assay PubChem Bioassay (2011)[AID] 
Target
Name:
DNA dC->dU-editing enzyme APOBEC-3A
Synonyms:
ABC3A_HUMAN probable DNA dC->dU-editing enzyme APOBEC-3A
Type:
Enzyme Catalytic Domain
Mol. Mass.:
23013.77
Organism:
Homo sapiens (Human)
Description:
gi_21955158
Residue:
199
  
Inhibitor
Name:
BDBM80394
Synonyms:
1,2-diethyl-3,6,6-trimethyl-5,7-dihydroindazol-1-ium-4-one;iodide SMR000129599 | cid_9550227
Type:
Small organic molecule
Emp. Form.:
C14H23N2O
Mol. Mass.:
235.3447
SMILES:
CCn1c(C)c2c(CC(C)(C)CC2=O)[n+]1CC
: