Target
DNA dC->dU-editing enzyme APOBEC-3A
Ligand
BDBM80544
Substrate
Meas. Tech.
Dose Response confirmation of small molecule APOBEC3A DNA Deaminase Inhibitors via a fluorescence-based single-stranded DNA deaminase assay
Temperature
298.15±n/a K
IC50
1910±n/a nM
Comments
extracted
Citation
 PubChem, PC Dose Response confirmation of small molecule APOBEC3A DNA Deaminase Inhibitors via a fluorescence-based single-stranded DNA deaminase assay PubChem Bioassay (2011)[AID] 
Target
Name:
DNA dC->dU-editing enzyme APOBEC-3A
Synonyms:
ABC3A_HUMAN probable DNA dC->dU-editing enzyme APOBEC-3A
Type:
Enzyme Catalytic Domain
Mol. Mass.:
23013.77
Organism:
Homo sapiens (Human)
Description:
gi_21955158
Residue:
199
  
Inhibitor
Name:
BDBM80544
Synonyms:
2-(6-Chloro-3-oxo-2,3-dihydro-benzo[1,4]oxazin-4-yl)-N-(3-methyl-pyridin-2-yl)-acetamide 2-(6-chloro-3-keto-1,4-benzoxazin-4-yl)-N-(3-methyl-2-pyridyl)acetamide 2-(6-chloro-3-oxo-1,4-benzoxazin-4-yl)-N-(3-methylpyridin-2-yl)acetamide SMR000525195 | cid_6473547
Type:
Small organic molecule
Emp. Form.:
C16H14ClN3O3
Mol. Mass.:
331.754
SMILES:
Cc1cccnc1NC(=O)CN1C(=O)COc2ccc(Cl)cc12
: