Target
C-C chemokine receptor type 6
Ligand
BDBM60225
Substrate
Meas. Tech.
Dose Response confirmation of small molecule antagonists of the CCR6 receptor: a luminescent beta-arrestin assay
IC50
16900±n/a nM
Citation
 PubChem, PC Dose Response confirmation of small molecule antagonists of the CCR6 receptor: a luminescent beta-arrestin assay PubChem Bioassay (2011)[AID] 
Target
Name:
C-C chemokine receptor type 6
Synonyms:
C-C chemokine receptor type 6 CCR6 CKRL3 GPR29 | STRL22
Type:
Enzyme
Mol. Mass.:
42510.84
Organism:
Homo sapiens (Human)
Description:
P51684
Residue:
374
  
Inhibitor
Name:
BDBM60225
Synonyms:
4-fluoranyl-N-[5-(4-methoxyphenyl)-1,3,4-oxadiazol-2-yl]benzamide MLS000530061 cid_4686761
Type:
Small organic molecule
Emp. Form.:
C16H12FN3O3
Mol. Mass.:
313.2832
SMILES:
COc1ccc(cc1)-c1nnc(NC(=O)c2ccc(F)cc2)o1
: