Target
C-C chemokine receptor type 6
Ligand
BDBM79981
Substrate
Meas. Tech.
Dose Response confirmation of small molecule antagonists of the CCR6 receptor: a luminescent beta-arrestin assay
IC50
17700±n/a nM
Citation
 PubChem, PC Dose Response confirmation of small molecule antagonists of the CCR6 receptor: a luminescent beta-arrestin assay PubChem Bioassay (2011)[AID] 
Target
Name:
C-C chemokine receptor type 6
Synonyms:
C-C chemokine receptor type 6 CCR6 CKRL3 GPR29 | STRL22
Type:
Enzyme
Mol. Mass.:
42510.84
Organism:
Homo sapiens (Human)
Description:
P51684
Residue:
374
  
Inhibitor
Name:
BDBM79981
Synonyms:
MLS000538111 N-(diallylthiocarbamoyl)-4-phenyl-benzamide N-[bis(prop-2-enyl)carbamothioyl]-4-phenyl-benzamide SMR000160671 | cid_1791929
Type:
Small organic molecule
Emp. Form.:
C20H20N2OS
Mol. Mass.:
336.451
SMILES:
C=CCN(CC=C)C(=S)NC(=O)c1ccc(cc1)-c1ccccc1
: