Target
C-C chemokine receptor type 6
Ligand
BDBM67953
Substrate
Meas. Tech.
Dose Response confirmation of small molecule antagonists of the CCR6 receptor: a luminescent beta-arrestin assay
IC50
19000±n/a nM
Citation
 PubChem, PC Dose Response confirmation of small molecule antagonists of the CCR6 receptor: a luminescent beta-arrestin assay PubChem Bioassay (2011)[AID] 
Target
Name:
C-C chemokine receptor type 6
Synonyms:
C-C chemokine receptor type 6 CCR6 CKRL3 GPR29 | STRL22
Type:
Enzyme
Mol. Mass.:
42510.84
Organism:
Homo sapiens (Human)
Description:
P51684
Residue:
374
  
Inhibitor
Name:
BDBM67953
Synonyms:
1-(3-chlorophenyl)-3-(1-phenyltetrazol-5-yl)sulfanylpyrrolidine-2,5-dione 1-(3-chlorophenyl)-3-[(1-phenyl-1H-tetrazol-5-yl)thio]-2,5-pyrrolidinedione 1-(3-chlorophenyl)-3-[(1-phenyltetrazol-5-yl)thio]pyrrolidine-2,5-quinone SMR000199391 | cid_2950397
Type:
Small organic molecule
Emp. Form.:
C17H12ClN5O2S
Mol. Mass.:
385.827
SMILES:
Oc1cc(Sc2nnnn2-c2ccccc2)c(O)n1-c1cccc(Cl)c1
: