Target
C-C chemokine receptor type 6
Ligand
BDBM58449
Substrate
Meas. Tech.
Dose Response confirmation of small molecule antagonists of the CCR6 receptor: a luminescent beta-arrestin assay
IC50
15100±n/a nM
Citation
 PubChem, PC Dose Response confirmation of small molecule antagonists of the CCR6 receptor: a luminescent beta-arrestin assay PubChem Bioassay (2011)[AID] 
Target
Name:
C-C chemokine receptor type 6
Synonyms:
C-C chemokine receptor type 6 CCR6 CKRL3 GPR29 | STRL22
Type:
Enzyme
Mol. Mass.:
42510.84
Organism:
Homo sapiens (Human)
Description:
P51684
Residue:
374
  
Inhibitor
Name:
BDBM58449
Synonyms:
1-[1-(2,4-dichlorophenyl)ethylideneamino]-3-(2-phenylethyl)thiourea MLS001176135 cid_5223401
Type:
Small organic molecule
Emp. Form.:
C17H17Cl2N3S
Mol. Mass.:
366.308
SMILES:
CC(=NNC(=S)NCCc1ccccc1)c1ccc(Cl)cc1Cl
: