Target
C-C chemokine receptor type 6
Ligand
BDBM80085
Substrate
Meas. Tech.
Dose Response confirmation of small molecule antagonists of the CCR6 receptor: a luminescent beta-arrestin assay
IC50
17700±n/a nM
Citation
 PubChem, PC Dose Response confirmation of small molecule antagonists of the CCR6 receptor: a luminescent beta-arrestin assay PubChem Bioassay (2011)[AID] 
Target
Name:
C-C chemokine receptor type 6
Synonyms:
C-C chemokine receptor type 6 CCR6 CKRL3 GPR29 | STRL22
Type:
Enzyme
Mol. Mass.:
42510.84
Organism:
Homo sapiens (Human)
Description:
P51684
Residue:
374
  
Inhibitor
Name:
BDBM80085
Synonyms:
10-(diiodomethylene)phenanthren-9-one 10-(diiodomethylidene)phenanthren-9-one MLS002702485 cid_400634
Type:
Small organic molecule
Emp. Form.:
C15H8I2O
Mol. Mass.:
458.0324
SMILES:
I\[#6](I)=[#6]-1/[#6](=O)-c2ccccc2-c2ccccc-12
: