Target
Hexokinase HKDC1 [W721R]
Ligand
BDBM42248
Substrate
Meas. Tech.
Dose Response confirmation of inhibitors of hexokinase domain containing I (HKDC1)
IC50
3730±n/a nM
Citation
 PubChem, PC Dose Response confirmation of inhibitors of hexokinase domain containing I (HKDC1) PubChem Bioassay (2011)[AID] 
Target
Name:
Hexokinase HKDC1 [W721R]
Synonyms:
HKDC1 putative hexokinase HKDC1
Type:
Enzyme Catalytic Domain
Mol. Mass.:
102520.24
Organism:
Homo sapiens (Human)
Description:
gi_156151420
Residue:
917
  
Inhibitor
Name:
BDBM42248
Synonyms:
9-(3,6-diketocyclohexa-1,4-dien-1-yl)-2-phenethyl-3,6,7,8-tetrahydropyrido[1,2-a]pyrazine-1,4-quinone 9-(3,6-dioxo-1-cyclohexa-1,4-dienyl)-2-(2-phenylethyl)-3,6,7,8-tetrahydropyrido[1,2-a]pyrazine-1,4-dione 9-[3,6-bis(oxidanylidene)cyclohexa-1,4-dien-1-yl]-2-(2-phenylethyl)-3,6,7,8-tetrahydropyrido[1,2-a]pyrazine-1,4-dione SMR000226463 | cid_998883
Type:
Small organic molecule
Emp. Form.:
C22H20N2O4
Mol. Mass.:
376.4052
SMILES:
O=C1CN(CCc2ccccc2)C(=O)C2=C(CCCN12)C1=CC(=O)C=CC1=O
: