Target
Hexokinase HKDC1 [W721R]
Ligand
BDBM48804
Substrate
Meas. Tech.
Dose Response confirmation of inhibitors of hexokinase domain containing I (HKDC1)
IC50
3200±n/a nM
Citation
 PubChem, PC Dose Response confirmation of inhibitors of hexokinase domain containing I (HKDC1) PubChem Bioassay (2011)[AID] 
Target
Name:
Hexokinase HKDC1 [W721R]
Synonyms:
HKDC1 putative hexokinase HKDC1
Type:
Enzyme Catalytic Domain
Mol. Mass.:
102520.24
Organism:
Homo sapiens (Human)
Description:
gi_156151420
Residue:
917
  
Inhibitor
Name:
BDBM48804
Synonyms:
3-(phenylmethyl)-2-[(E)-2-(3-pyridinyl)ethenyl]-4-quinazolinone 3-benzyl-2-[(E)-2-(3-pyridyl)vinyl]quinazolin-4-one MLS000709026 cid_5738263
Type:
Small organic molecule
Emp. Form.:
C22H17N3O
Mol. Mass.:
339.3899
SMILES:
O=c1n(Cc2ccccc2)c(\C=C\c2cccnc2)nc2ccccc12
: