Target
Hexokinase HKDC1 [W721R]
Ligand
BDBM33185
Substrate
Meas. Tech.
Dose Response confirmation of inhibitors of hexokinase domain containing I (HKDC1)
IC50
2740±n/a nM
Citation
 PubChem, PC Dose Response confirmation of inhibitors of hexokinase domain containing I (HKDC1) PubChem Bioassay (2011)[AID] 
Target
Name:
Hexokinase HKDC1 [W721R]
Synonyms:
HKDC1 putative hexokinase HKDC1
Type:
Enzyme Catalytic Domain
Mol. Mass.:
102520.24
Organism:
Homo sapiens (Human)
Description:
gi_156151420
Residue:
917
  
Inhibitor
Name:
BDBM33185
Synonyms:
4-({(4Z)-1-oxo-4-[(phenylsulfonyl)imino]-1,4-dihydronaphthalen-2-yl}amino)benzoic acid 4-[[(4Z)-4-besylimino-1-keto-2-naphthyl]amino]benzoic acid 4-[[4-(benzenesulfonylimino)-1-oxo-2-naphthalenyl]amino]benzoic acid MLS000686314 cid_4053104
Type:
Small organic molecule
Emp. Form.:
C23H16N2O5S
Mol. Mass.:
432.449
SMILES:
OC(=O)c1ccc(NC2=CC(=NS(=O)(=O)c3ccccc3)c3ccccc3C2=O)cc1
: