Target
Hexokinase HKDC1 [W721R]
Ligand
BDBM42405
Substrate
Meas. Tech.
Dose Response confirmation of activators of hexokinase domain containing I (HKDC1)
EC50
11700±n/a nM
Citation
 PubChem, PC Dose Response confirmation of activators of hexokinase domain containing I (HKDC1) PubChem Bioassay (2011)[AID] 
Target
Name:
Hexokinase HKDC1 [W721R]
Synonyms:
HKDC1 putative hexokinase HKDC1
Type:
Enzyme Catalytic Domain
Mol. Mass.:
102520.24
Organism:
Homo sapiens (Human)
Description:
gi_156151420
Residue:
917
  
Inhibitor
Name:
BDBM42405
Synonyms:
MLS000110376 N-(2-piperazinoacenaphthen-1-yl)benzenesulfonamide SMR000106306 | cid_2898054
Type:
Small organic molecule
Emp. Form.:
C22H23N3O2S
Mol. Mass.:
393.502
SMILES:
O=S(=O)(NC1C(N2CCNCC2)c2cccc3cccc1c23)c1ccccc1
: