Target
Hexokinase HKDC1 [W721R]
Ligand
BDBM57860
Substrate
Meas. Tech.
Dose Response confirmation of activators of hexokinase domain containing I (HKDC1)
EC50
>80000±n/a nM
Citation
 PubChem, PC Dose Response confirmation of activators of hexokinase domain containing I (HKDC1) PubChem Bioassay (2011)[AID] 
Target
Name:
Hexokinase HKDC1 [W721R]
Synonyms:
HKDC1 putative hexokinase HKDC1
Type:
Enzyme Catalytic Domain
Mol. Mass.:
102520.24
Organism:
Homo sapiens (Human)
Description:
gi_156151420
Residue:
917
  
Inhibitor
Name:
BDBM57860
Synonyms:
(2Z)-2-[(1-ethyl-8-methyl-2-quinolin-1-iumyl)methylidene]-3-methyl-1,3-benzothiazole;iodide (2Z)-2-[(1-ethyl-8-methyl-quinolin-1-ium-2-yl)methylidene]-3-methyl-1,3-benzothiazole;iodide MLS000709676 cid_16192857
Type:
Small organic molecule
Emp. Form.:
C21H21N2S
Mol. Mass.:
333.469
SMILES:
CC[n+]1c(\C=C2/Sc3ccccc3N2C)ccc2cccc(C)c12
: