Target
Hexokinase HKDC1 [W721R]
Ligand
BDBM80794
Substrate
Meas. Tech.
Dose Response confirmation of activators of hexokinase domain containing I (HKDC1)
EC50
34400±n/a nM
Citation
 PubChem, PC Dose Response confirmation of activators of hexokinase domain containing I (HKDC1) PubChem Bioassay (2011)[AID] 
Target
Name:
Hexokinase HKDC1 [W721R]
Synonyms:
HKDC1 putative hexokinase HKDC1
Type:
Enzyme Catalytic Domain
Mol. Mass.:
102520.24
Organism:
Homo sapiens (Human)
Description:
gi_156151420
Residue:
917
  
Inhibitor
Name:
BDBM80794
Synonyms:
5-[1-(2-methoxyethyl)-2,5-dimethyl-3-pyrrolyl]-N-[4-(4-morpholinylsulfonyl)phenyl]-6H-1,3,4-thiadiazin-2-amine 5-[1-(2-methoxyethyl)-2,5-dimethylpyrrol-3-yl]-N-(4-morpholin-4-ylsulfonylphenyl)-6H-1,3,4-thiadiazin-2-amine SMR000370725 cid_3579984
Type:
Small organic molecule
Emp. Form.:
C22H29N5O4S2
Mol. Mass.:
491.627
SMILES:
COCCn1c(C)cc(c1C)C1=NN=C(Nc2ccc(cc2)S(=O)(=O)N2CCOCC2)SC1
: