Target
Hexokinase HKDC1 [W721R]
Ligand
BDBM80803
Substrate
Meas. Tech.
Dose Response confirmation of activators of hexokinase domain containing I (HKDC1)
EC50
25400±n/a nM
Citation
 PubChem, PC Dose Response confirmation of activators of hexokinase domain containing I (HKDC1) PubChem Bioassay (2011)[AID] 
Target
Name:
Hexokinase HKDC1 [W721R]
Synonyms:
HKDC1 putative hexokinase HKDC1
Type:
Enzyme Catalytic Domain
Mol. Mass.:
102520.24
Organism:
Homo sapiens (Human)
Description:
gi_156151420
Residue:
917
  
Inhibitor
Name:
BDBM80803
Synonyms:
2-(4-pyridin-2-ylpiperazin-1-yl)quinazolin-4-amine;hydrochloride MLS001214409 [2-[4-(2-pyridyl)piperazino]quinazolin-4-yl]amine;hydrochloride | cid_16812276
Type:
Small organic molecule
Emp. Form.:
C17H18N6
Mol. Mass.:
306.365
SMILES:
Nc1nc(nc2ccccc12)N1CCN(CC1)c1ccccn1
: