Target
Hexokinase HKDC1 [W721R]
Ligand
BDBM80820
Substrate
Meas. Tech.
Dose Response confirmation of activators of hexokinase domain containing I (HKDC1)
EC50
27800±n/a nM
Citation
 PubChem, PC Dose Response confirmation of activators of hexokinase domain containing I (HKDC1) PubChem Bioassay (2011)[AID] 
Target
Name:
Hexokinase HKDC1 [W721R]
Synonyms:
HKDC1 putative hexokinase HKDC1
Type:
Enzyme Catalytic Domain
Mol. Mass.:
102520.24
Organism:
Homo sapiens (Human)
Description:
gi_156151420
Residue:
917
  
Inhibitor
Name:
BDBM80820
Synonyms:
1-(2-pyridinylmethyl)-3-(2-pyridinylmethylideneamino)thiourea 1-(pyridin-2-ylmethyl)-3-(pyridin-2-ylmethylideneamino)thiourea SMR001565798 | cid_3005742
Type:
Small organic molecule
Emp. Form.:
C13H13N5S
Mol. Mass.:
271.341
SMILES:
S=C(NCc1ccccn1)NN=Cc1ccccn1
: