Target
Tropomyosin alpha-1 chain
Ligand
BDBM80830
Substrate
Meas. Tech.
Fluorescence-based biochemical high throughput dose response assay for inhibitors of the calcium sensitivity of cardiac Regulated Thin Filaments (RTF)
IC50
8598±n/a nM
Citation
 PubChem, PC Fluorescence-based biochemical high throughput dose response assay for inhibitors of the calcium sensitivity of cardiac Regulated Thin Filaments (RTF) PubChem Bioassay (2011)[AID] 
Target
Name:
Tropomyosin alpha-1 chain
Synonyms:
TPM1 cardiac alpha tropomyosin
Type:
Enzyme Catalytic Domain
Mol. Mass.:
32681.01
Organism:
Sus scrofa
Description:
P42639
Residue:
284
  
Inhibitor
Name:
BDBM80830
Synonyms:
4-[(2-oxo-1-carbazolyl)hydrazo]benzenecarboximidamide 4-[2-(2-oxocarbazol-1-yl)hydrazinyl]benzenecarboximidamide MLS002701853 cid_5477815
Type:
Small organic molecule
Emp. Form.:
C19H15N5O
Mol. Mass.:
329.3553
SMILES:
NC(=N)c1ccc(cc1)N=Nc1c(O)ccc2c3ccccc3[nH]c12
: