Target
Cysteine protease ATG4B
Ligand
BDBM34671
Substrate
Meas. Tech.
Dose response confirmation of the uHTS fluorescent assay for identification of inhibitors of ATG4B.
IC50
3730±n/a nM
Citation
 PubChem, PC Dose response confirmation of the uHTS fluorescent assay for identification of inhibitors of ATG4B. PubChem Bioassay (2011)[AID] 
Target
Name:
Cysteine protease ATG4B
Synonyms:
APG4B ATG4B_HUMAN KIAA0943 hck
Type:
Enzyme Catalytic Domain
Mol. Mass.:
44279.79
Organism:
Homo sapiens (Human)
Description:
gi_47132611
Residue:
393
  
Inhibitor
Name:
BDBM34671
Synonyms:
1,3,6-Trimethyl-1H-pyrimido[5,4-e][1,2,4]triazine-5,7-dione 1,3,6-trimethylpyrimido[5,4-e][1,2,4]triazine-5,7-quinone SMR000121073 cid_460747
Type:
Small organic molecule
Emp. Form.:
C8H9N5O2
Mol. Mass.:
207.1894
SMILES:
Cc1nn(C)c2nc(=O)n(C)c(=O)c2n1
: