Target
Cysteine protease ATG4B
Ligand
BDBM53155
Substrate
Meas. Tech.
Dose response confirmation of the uHTS fluorescent assay for identification of inhibitors of ATG4B.
IC50
2960±n/a nM
Citation
 PubChem, PC Dose response confirmation of the uHTS fluorescent assay for identification of inhibitors of ATG4B. PubChem Bioassay (2011)[AID] 
Target
Name:
Cysteine protease ATG4B
Synonyms:
APG4B ATG4B_HUMAN KIAA0943 hck
Type:
Enzyme Catalytic Domain
Mol. Mass.:
44279.79
Organism:
Homo sapiens (Human)
Description:
gi_47132611
Residue:
393
  
Inhibitor
Name:
BDBM53155
Synonyms:
5-(4-bromophenyl)-2,8-dimercapto-5H-pyrimido[5',4':5,6]pyrano[2,3-d]pyrimidine-4,6-diol SMR000555786 | cid_3802184
Type:
Small organic molecule
Emp. Form.:
C15H9BrN4O3S2
Mol. Mass.:
437.291
SMILES:
Brc1ccc(cc1)C1c2c(Oc3[nH]c(=S)[nH]c(=O)c13)[nH]c(=S)[nH]c2=O
: