Target
Cysteine protease ATG4B
Ligand
BDBM31751
Substrate
Meas. Tech.
Dose response confirmation of the uHTS fluorescent assay for identification of inhibitors of ATG4B.
IC50
11400±n/a nM
Citation
 PubChem, PC Dose response confirmation of the uHTS fluorescent assay for identification of inhibitors of ATG4B. PubChem Bioassay (2011)[AID] 
Target
Name:
Cysteine protease ATG4B
Synonyms:
APG4B ATG4B_HUMAN KIAA0943 hck
Type:
Enzyme Catalytic Domain
Mol. Mass.:
44279.79
Organism:
Homo sapiens (Human)
Description:
gi_47132611
Residue:
393
  
Inhibitor
Name:
BDBM31751
Synonyms:
3-[(2-chlorobenzyl)thio]-5,6-bis(2-furyl)-1,2,4-triazine 3-[(2-chlorophenyl)methylthio]-5,6-bis(2-furanyl)-1,2,4-triazine cid_6400942
Type:
Small organic molecule
Emp. Form.:
C18H12ClN3O2S
Mol. Mass.:
369.825
SMILES:
Clc1ccccc1CSc1nnc(-c2ccco2)c(n1)-c1ccco1
: