Target
Hexokinase-1
Ligand
BDBM80765
Substrate
Meas. Tech.
Dose Response confirmation of activators of hexokinase domain containing I (HKDC1) in the hexokinase 1 selectivity assay
EC50
35100±n/a nM
Citation
 PubChem, PC Dose Response confirmation of activators of hexokinase domain containing I (HKDC1) in the hexokinase 1 selectivity assay PubChem Bioassay (2011)[AID] 
Target
Name:
Hexokinase-1
Synonyms:
Brain form hexokinase HK1 Hexokinase type I hexokinase-1 isoform HKI
Type:
PROTEIN
Mol. Mass.:
102488.34
Organism:
Homo sapiens (Human)
Description:
EBI_11382
Residue:
917
  
Inhibitor
Name:
BDBM80765
Synonyms:
8-(3,4-dimethoxyphenyl)-1,3-dimethyl-7-[(3-phenyl-2-isoxazolin-5-yl)methyl]xanthine 8-(3,4-dimethoxyphenyl)-1,3-dimethyl-7-[(3-phenyl-4,5-dihydroisoxazol-5-yl)methyl]purine-2,6-dione SMR000037549 | cid_666224
Type:
Small organic molecule
Emp. Form.:
C25H25N5O5
Mol. Mass.:
475.4965
SMILES:
COc1ccc(cc1OC)-c1nc2n(C)c(=O)n(C)c(=O)c2n1CC1CC(=NO1)c1ccccc1
: