Target
Hexokinase-1
Ligand
BDBM47735
Substrate
Meas. Tech.
Dose Response confirmation of activators of hexokinase domain containing I (HKDC1) in the hexokinase 1 selectivity assay
EC50
46800±n/a nM
Citation
 PubChem, PC Dose Response confirmation of activators of hexokinase domain containing I (HKDC1) in the hexokinase 1 selectivity assay PubChem Bioassay (2011)[AID] 
Target
Name:
Hexokinase-1
Synonyms:
Brain form hexokinase HK1 Hexokinase type I hexokinase-1 isoform HKI
Type:
PROTEIN
Mol. Mass.:
102488.34
Organism:
Homo sapiens (Human)
Description:
EBI_11382
Residue:
917
  
Inhibitor
Name:
BDBM47735
Synonyms:
3-chloranyl-N-(3,3-dimethylbutan-2-yl)-6-nitro-1-benzothiophene-2-carboxamide 3-chloro-6-nitro-N-(1,2,2-trimethylpropyl)benzothiophene-2-carboxamide MLS000583265 cid_2971539
Type:
Small organic molecule
Emp. Form.:
C15H17ClN2O3S
Mol. Mass.:
340.825
SMILES:
CC(NC(=O)c1sc2cc(ccc2c1Cl)[N+]([O-])=O)C(C)(C)C
: