Target
Hexokinase-1
Ligand
BDBM52656
Substrate
Meas. Tech.
Dose Response confirmation of activators of hexokinase domain containing I (HKDC1) in the hexokinase 1 selectivity assay
EC50
6540±n/a nM
Citation
 PubChem, PC Dose Response confirmation of activators of hexokinase domain containing I (HKDC1) in the hexokinase 1 selectivity assay PubChem Bioassay (2011)[AID] 
Target
Name:
Hexokinase-1
Synonyms:
Brain form hexokinase HK1 Hexokinase type I hexokinase-1 isoform HKI
Type:
PROTEIN
Mol. Mass.:
102488.34
Organism:
Homo sapiens (Human)
Description:
EBI_11382
Residue:
917
  
Inhibitor
Name:
BDBM52656
Synonyms:
1-[5-acetyl-3-methyl-6-(3-nitrophenyl)-5H-[1,2,4]triazolo[3,4-b][1,3,4]thiadiazin-7-yl]ethanone 1-[5-ethanoyl-3-methyl-6-(3-nitrophenyl)-[1,2,4]triazolo[3,4-b][1,3,4]thiadiazin-7-yl]ethanone SMR000312282 | cid_1511959
Type:
Small organic molecule
Emp. Form.:
C15H13N5O4S
Mol. Mass.:
359.36
SMILES:
CC(=O)[C-]1Sc2nn[c-](C)[n+]2[N+](C(C)=O)=C1c1cccc(c1)[N+]([O-])=O
: