Target
Hexokinase-1
Ligand
BDBM80797
Substrate
Meas. Tech.
Dose Response confirmation of activators of hexokinase domain containing I (HKDC1) in the hexokinase 1 selectivity assay
EC50
46000±n/a nM
Citation
 PubChem, PC Dose Response confirmation of activators of hexokinase domain containing I (HKDC1) in the hexokinase 1 selectivity assay PubChem Bioassay (2011)[AID] 
Target
Name:
Hexokinase-1
Synonyms:
Brain form hexokinase HK1 Hexokinase type I hexokinase-1 isoform HKI
Type:
PROTEIN
Mol. Mass.:
102488.34
Organism:
Homo sapiens (Human)
Description:
EBI_11382
Residue:
917
  
Inhibitor
Name:
BDBM80797
Synonyms:
(4-morpholinosulfonylphenyl)-[5-(1,2,5-trimethylpyrrol-3-yl)-6H-1,3,4-thiadiazin-2-yl]amine N-(4-morpholin-4-ylsulfonylphenyl)-5-(1,2,5-trimethylpyrrol-3-yl)-6H-1,3,4-thiadiazin-2-amine SMR000365305 | cid_4882843
Type:
Small organic molecule
Emp. Form.:
C20H25N5O3S2
Mol. Mass.:
447.574
SMILES:
Cc1cc(c(C)n1C)C1=NN=C(Nc2ccc(cc2)S(=O)(=O)N2CCOCC2)SC1
: