Target
Hexokinase-1
Ligand
BDBM80804
Substrate
Meas. Tech.
Dose Response confirmation of activators of hexokinase domain containing I (HKDC1) in the hexokinase 1 selectivity assay
EC50
21100±n/a nM
Citation
 PubChem, PC Dose Response confirmation of activators of hexokinase domain containing I (HKDC1) in the hexokinase 1 selectivity assay PubChem Bioassay (2011)[AID] 
Target
Name:
Hexokinase-1
Synonyms:
Brain form hexokinase HK1 Hexokinase type I hexokinase-1 isoform HKI
Type:
PROTEIN
Mol. Mass.:
102488.34
Organism:
Homo sapiens (Human)
Description:
EBI_11382
Residue:
917
  
Inhibitor
Name:
BDBM80804
Synonyms:
2-Ethyl-3-methyl-1-methylamino-benzo[4,5]imidazo[1,2-a]pyridine-4-carbonitrile 2-ethyl-3-methyl-1-(methylamino)pyrido[1,2-a]benzimidazole-4-carbonitrile SMR000558985 | cid_779734
Type:
Small organic molecule
Emp. Form.:
C16H16N4
Mol. Mass.:
264.325
SMILES:
CCc1c(C)c(C#N)c2nc3ccccc3n2c1NC
: