Target
Hexokinase-1
Ligand
BDBM80808
Substrate
Meas. Tech.
Dose Response confirmation of activators of hexokinase domain containing I (HKDC1) in the hexokinase 1 selectivity assay
EC50
11800±n/a nM
Citation
 PubChem, PC Dose Response confirmation of activators of hexokinase domain containing I (HKDC1) in the hexokinase 1 selectivity assay PubChem Bioassay (2011)[AID] 
Target
Name:
Hexokinase-1
Synonyms:
Brain form hexokinase HK1 Hexokinase type I hexokinase-1 isoform HKI
Type:
PROTEIN
Mol. Mass.:
102488.34
Organism:
Homo sapiens (Human)
Description:
EBI_11382
Residue:
917
  
Inhibitor
Name:
BDBM80808
Synonyms:
2-(2-amino-6-methylsulfanylpurin-9-yl)-N-[(1R)-1-naphthalen-1-ylethyl]acetamide 2-[2-amino-6-(methylthio)-9-purinyl]-N-[(1R)-1-(1-naphthalenyl)ethyl]acetamide MLS002477170 cid_44246604
Type:
Small organic molecule
Emp. Form.:
C20H20N6OS
Mol. Mass.:
392.477
SMILES:
CSc1nc(N)nc2n(CC(=O)N[C@H](C)c3cccc4ccccc34)cnc12
: