Target
Hexokinase-1
Ligand
BDBM80817
Substrate
Meas. Tech.
Dose Response confirmation of activators of hexokinase domain containing I (HKDC1) in the hexokinase 1 selectivity assay
EC50
>80000±n/a nM
Citation
 PubChem, PC Dose Response confirmation of activators of hexokinase domain containing I (HKDC1) in the hexokinase 1 selectivity assay PubChem Bioassay (2011)[AID] 
Target
Name:
Hexokinase-1
Synonyms:
Brain form hexokinase HK1 Hexokinase type I hexokinase-1 isoform HKI
Type:
PROTEIN
Mol. Mass.:
102488.34
Organism:
Homo sapiens (Human)
Description:
EBI_11382
Residue:
917
  
Inhibitor
Name:
BDBM80817
Synonyms:
1-(2-methoxyphenyl)-3-(1-pyridin-2-ylethylideneamino)thiourea 1-(2-methoxyphenyl)-3-[1-(2-pyridyl)ethylideneamino]thiourea SMR001565759 | cid_3005719
Type:
Small organic molecule
Emp. Form.:
C15H16N4OS
Mol. Mass.:
300.379
SMILES:
COc1ccccc1NC(=S)NN=C(C)c1ccccn1
: