Target
Hexokinase HKDC1 [W721R]
Ligand
BDBM80687
Substrate
Meas. Tech.
Dose Response confirmation of inhibitors of hexokinase domain containing I (HKDC1) in the hexokinase 1 selectivity assay
IC50
2360±n/a nM
Citation
 PubChem, PC Dose Response confirmation of inhibitors of hexokinase domain containing I (HKDC1) in the hexokinase 1 selectivity assay PubChem Bioassay (2011)[AID] 
Target
Name:
Hexokinase HKDC1 [W721R]
Synonyms:
HKDC1 putative hexokinase HKDC1
Type:
Enzyme Catalytic Domain
Mol. Mass.:
102520.24
Organism:
Homo sapiens (Human)
Description:
gi_156151420
Residue:
917
  
Inhibitor
Name:
BDBM80687
Synonyms:
MLS000084034 cid_667382
Type:
Small organic molecule
Emp. Form.:
C22H28N4O3
Mol. Mass.:
396.4827
SMILES:
CC(C)c1nc2oc3c(NCC4CCCO4)ncnc3c2c2CC(C)(C)OCc12
: