Target
Hexokinase HKDC1 [W721R]
Ligand
BDBM80718
Substrate
Meas. Tech.
Dose Response confirmation of inhibitors of hexokinase domain containing I (HKDC1) in the hexokinase 1 selectivity assay
IC50
6040±n/a nM
Citation
 PubChem, PC Dose Response confirmation of inhibitors of hexokinase domain containing I (HKDC1) in the hexokinase 1 selectivity assay PubChem Bioassay (2011)[AID] 
Target
Name:
Hexokinase HKDC1 [W721R]
Synonyms:
HKDC1 putative hexokinase HKDC1
Type:
Enzyme Catalytic Domain
Mol. Mass.:
102520.24
Organism:
Homo sapiens (Human)
Description:
gi_156151420
Residue:
917
  
Inhibitor
Name:
BDBM80718
Synonyms:
MLS000419093 N-[2-(7-methyl-2-oxidanylidene-1H-quinolin-3-yl)ethyl]-4-piperidin-1-ylsulfonyl-benzamide N-[2-(7-methyl-2-oxo-1H-quinolin-3-yl)ethyl]-4-piperidin-1-ylsulfonylbenzamide cid_4110989
Type:
Small organic molecule
Emp. Form.:
C24H27N3O4S
Mol. Mass.:
453.554
SMILES:
Cc1ccc2cc(CCNC(=O)c3ccc(cc3)S(=O)(=O)N3CCCCC3)c(=O)[nH]c2c1
: