Target
Hexokinase HKDC1 [W721R]
Ligand
BDBM80067
Substrate
Meas. Tech.
Dose Response confirmation of inhibitors of hexokinase domain containing I (HKDC1) in the hexokinase 1 selectivity assay
IC50
4010±n/a nM
Citation
 PubChem, PC Dose Response confirmation of inhibitors of hexokinase domain containing I (HKDC1) in the hexokinase 1 selectivity assay PubChem Bioassay (2011)[AID] 
Target
Name:
Hexokinase HKDC1 [W721R]
Synonyms:
HKDC1 putative hexokinase HKDC1
Type:
Enzyme Catalytic Domain
Mol. Mass.:
102520.24
Organism:
Homo sapiens (Human)
Description:
gi_156151420
Residue:
917
  
Inhibitor
Name:
BDBM80067
Synonyms:
MLS002693850 N-(1,4-dioxo-2-naphthalenyl)benzamide N-[1,4-bis(oxidanylidene)naphthalen-2-yl]benzamide cid_4882
Type:
Small organic molecule
Emp. Form.:
C17H11NO3
Mol. Mass.:
277.2741
SMILES:
O=C(NC1=CC(=O)c2ccccc2C1=O)c1ccccc1
: