Target
Hexokinase HKDC1 [W721R]
Ligand
BDBM80075
Substrate
Meas. Tech.
Dose Response confirmation of inhibitors of hexokinase domain containing I (HKDC1) in the hexokinase 1 selectivity assay
IC50
4890±n/a nM
Citation
 PubChem, PC Dose Response confirmation of inhibitors of hexokinase domain containing I (HKDC1) in the hexokinase 1 selectivity assay PubChem Bioassay (2011)[AID] 
Target
Name:
Hexokinase HKDC1 [W721R]
Synonyms:
HKDC1 putative hexokinase HKDC1
Type:
Enzyme Catalytic Domain
Mol. Mass.:
102520.24
Organism:
Homo sapiens (Human)
Description:
gi_156151420
Residue:
917
  
Inhibitor
Name:
BDBM80075
Synonyms:
7-bromanyl-6-methoxy-quinoline-5,8-dione 7-bromo-6-methoxyquinoline-5,8-dione SMR001570458 | cid_265935
Type:
Small organic molecule
Emp. Form.:
C10H6BrNO3
Mol. Mass.:
268.064
SMILES:
COC1=C(Br)C(=O)c2ncccc2C1=O
: