Target
Glucose-6-phosphate dehydrogenase-6-phosphogluconolactonase
Ligand
BDBM41826
Substrate
Meas. Tech.
Dose Response confirmation of uHTS small molecule inhibitors of Plasmodium falciparum Glucose-6-phosphate dehydrogenase via a fluorescence intensity assay
IC50
1260±n/a nM
Citation
 PubChem, PC Dose Response confirmation of uHTS small molecule inhibitors of Plasmodium falciparum Glucose-6-phosphate dehydrogenase via a fluorescence intensity assay PubChem Bioassay (2011)[AID] 
Target
Name:
Glucose-6-phosphate dehydrogenase-6-phosphogluconolactonase
Synonyms:
Type:
Enzyme Catalytic Domain
Mol. Mass.:
109731.64
Organism:
Plasmodium falciparum 3D7
Description:
gi_12381848
Residue:
950
  
Inhibitor
Name:
BDBM41826
Synonyms:
2-[[(4E)-1-keto-4-(2-thienylsulfonylimino)-2-naphthyl]amino]benzoic acid methyl ester MLS000521465 cid_9550941 methyl 2-[[(4E)-1-oxo-4-thiophen-2-ylsulfonyliminonaphthalen-2-yl]amino]benzoate
Type:
Small organic molecule
Emp. Form.:
C22H16N2O5S2
Mol. Mass.:
452.503
SMILES:
COC(=O)c1ccccc1NC1=CC(=NS(=O)(=O)c2cccs2)c2ccccc2C1=O
: