Target
Glucose-6-phosphate dehydrogenase-6-phosphogluconolactonase
Ligand
BDBM52429
Substrate
Meas. Tech.
Dose Response confirmation of uHTS small molecule inhibitors of Plasmodium falciparum Glucose-6-phosphate dehydrogenase via a fluorescence intensity assay
IC50
1220±n/a nM
Citation
 PubChem, PC Dose Response confirmation of uHTS small molecule inhibitors of Plasmodium falciparum Glucose-6-phosphate dehydrogenase via a fluorescence intensity assay PubChem Bioassay (2011)[AID] 
Target
Name:
Glucose-6-phosphate dehydrogenase-6-phosphogluconolactonase
Synonyms:
Type:
Enzyme Catalytic Domain
Mol. Mass.:
109731.64
Organism:
Plasmodium falciparum 3D7
Description:
gi_12381848
Residue:
950
  
Inhibitor
Name:
BDBM52429
Synonyms:
4-fluoranyl-N-(4-oxidanyl-3-quinolin-8-ylsulfanyl-naphthalen-1-yl)benzenesulfonamide 4-fluoro-N-[4-hydroxy-3-(8-quinolinylthio)-1-naphthalenyl]benzenesulfonamide 4-fluoro-N-[4-hydroxy-3-(8-quinolylthio)-1-naphthyl]benzenesulfonamide SMR000200036 | cid_2133793
Type:
Small organic molecule
Emp. Form.:
C25H17FN2O3S2
Mol. Mass.:
476.542
SMILES:
Oc1c(Sc2cccc3cccnc23)cc(NS(=O)(=O)c2ccc(F)cc2)c2ccccc12
: