Target
Glucose-6-phosphate dehydrogenase-6-phosphogluconolactonase
Ligand
BDBM31355
Substrate
Meas. Tech.
Dose Response confirmation of uHTS small molecule inhibitors of Plasmodium falciparum Glucose-6-phosphate dehydrogenase via a fluorescence intensity assay
IC50
13200±n/a nM
Citation
 PubChem, PC Dose Response confirmation of uHTS small molecule inhibitors of Plasmodium falciparum Glucose-6-phosphate dehydrogenase via a fluorescence intensity assay PubChem Bioassay (2011)[AID] 
Target
Name:
Glucose-6-phosphate dehydrogenase-6-phosphogluconolactonase
Synonyms:
Type:
Enzyme Catalytic Domain
Mol. Mass.:
109731.64
Organism:
Plasmodium falciparum 3D7
Description:
gi_12381848
Residue:
950
  
Inhibitor
Name:
BDBM31355
Synonyms:
2,2-Di-m-tolyl-cyclopropanecarboxylic acid (2-hydroxy-4-nitro-phenyl)-amide MLS000554437 N-(2-hydroxy-4-nitrophenyl)-2,2-bis(3-methylphenyl)-1-cyclopropanecarboxamide SMR000171420 | cid_3105194
Type:
Small organic molecule
Emp. Form.:
C24H22N2O4
Mol. Mass.:
402.4425
SMILES:
Cc1cccc(c1)C1(CC1C(=O)Nc1ccc(cc1O)[N+]([O-])=O)c1cccc(C)c1
: