Target
Glucose-6-phosphate dehydrogenase-6-phosphogluconolactonase
Ligand
BDBM50273
Substrate
Meas. Tech.
Dose Response confirmation of uHTS small molecule inhibitors of Plasmodium falciparum Glucose-6-phosphate dehydrogenase via a fluorescence intensity assay
IC50
1190±n/a nM
Citation
 PubChem, PC Dose Response confirmation of uHTS small molecule inhibitors of Plasmodium falciparum Glucose-6-phosphate dehydrogenase via a fluorescence intensity assay PubChem Bioassay (2011)[AID] 
Target
Name:
Glucose-6-phosphate dehydrogenase-6-phosphogluconolactonase
Synonyms:
Type:
Enzyme Catalytic Domain
Mol. Mass.:
109731.64
Organism:
Plasmodium falciparum 3D7
Description:
gi_12381848
Residue:
950
  
Inhibitor
Name:
BDBM50273
Synonyms:
2-[1-hydroxy-4-[(2,4,5-trimethylphenyl)sulfonylamino]naphthalen-2-yl]sulfanylacetic acid 2-[[1-hydroxy-4-[(2,4,5-trimethylphenyl)sulfonylamino]-2-naphthalenyl]thio]acetic acid MLS000697055 cid_6710564
Type:
Small organic molecule
Emp. Form.:
C21H21NO5S2
Mol. Mass.:
431.525
SMILES:
Cc1cc(C)c(cc1C)S(=O)(=O)Nc1cc(SCC(O)=O)c(O)c2ccccc12
: