Target
Glucose-6-phosphate dehydrogenase-6-phosphogluconolactonase
Ligand
BDBM65733
Substrate
Meas. Tech.
Dose Response confirmation of uHTS small molecule inhibitors of Plasmodium falciparum Glucose-6-phosphate dehydrogenase via a fluorescence intensity assay
IC50
3160±n/a nM
Citation
 PubChem, PC Dose Response confirmation of uHTS small molecule inhibitors of Plasmodium falciparum Glucose-6-phosphate dehydrogenase via a fluorescence intensity assay PubChem Bioassay (2011)[AID] 
Target
Name:
Glucose-6-phosphate dehydrogenase-6-phosphogluconolactonase
Synonyms:
Type:
Enzyme Catalytic Domain
Mol. Mass.:
109731.64
Organism:
Plasmodium falciparum 3D7
Description:
gi_12381848
Residue:
950
  
Inhibitor
Name:
BDBM65733
Synonyms:
3-methyl-8-nitro-7-(phenylmethyl)purine-2,6-dione 7-benzyl-3-methyl-8-nitropurine-2,6-dione cid_909915
Type:
Small organic molecule
Emp. Form.:
C13H11N5O4
Mol. Mass.:
301.2575
SMILES:
Cn1c2nc(n(Cc3ccccc3)c2c(=O)[nH]c1=O)[N+]([O-])=O
: