Target
Glucose-6-phosphate 1-dehydrogenase
Ligand
BDBM33096
Substrate
Meas. Tech.
Human Glucose-6-Phosphate Dehydrogenase Dose Response Selectivity Assay for Inhibitors of Plasmodium falciparum Glucose-6-Phosphate Dehydrogenase
IC50
>80000±n/a nM
Citation
 PubChem, PC Human Glucose-6-Phosphate Dehydrogenase Dose Response Selectivity Assay for Inhibitors of Plasmodium falciparum Glucose-6-Phosphate Dehydrogenase PubChem Bioassay (2011)[AID] 
Target
Name:
Glucose-6-phosphate 1-dehydrogenase
Synonyms:
G6PD Glucose 6-phosphate dehydrogenase (G6PD) glucose-6-phosphate 1-dehydrogenase isoform b
Type:
Enzyme
Mol. Mass.:
59258.58
Organism:
Homo sapiens (Human)
Description:
P11413
Residue:
515
  
Inhibitor
Name:
BDBM33096
Synonyms:
3-[[7-(1,3-benzothiazol-2-ylsulfanyl)-4-nitro-2,1,3-benzoxadiazol-5-yl]amino]propan-1-ol 3-[[7-(1,3-benzothiazol-2-ylthio)-4-nitro-benzofurazan-5-yl]amino]propan-1-ol SMR000131403 | cid_11957180
Type:
Small organic molecule
Emp. Form.:
C16H13N5O4S2
Mol. Mass.:
403.436
SMILES:
OCCCNc1cc(Sc2nc3ccccc3s2)c2nonc2c1[N+]([O-])=O
: