Target
cAMP-dependent protein kinase type I-alpha regulatory subunit
Ligand
BDBM81288
Substrate
Meas. Tech.
Counterscreen for activators of the Protein Kinase A-R2B (PKA-R2B) complex
EC50
7827±n/a nM
Citation
 PubChem, PC Counterscreen for activators of the Protein Kinase A-R2B (PKA-R2B) complex: fluorescence polarization-based biochemical high throughput dose response assay to identify activators of the Protein Kinase A-R1A (PKA-R1A) complex PubChem Bioassay (2011)[AID] 
Target
Name:
cAMP-dependent protein kinase type I-alpha regulatory subunit
Synonyms:
KAP0_BOVIN cAMP-dependent protein kinase
Type:
Enzyme Catalytic Domain
Mol. Mass.:
42885.14
Organism:
Bos taurus
Description:
gi_115496662
Residue:
380
  
Inhibitor
Name:
BDBM81288
Synonyms:
8-Bromoguanosine 3',5'-cyclic monophosphate sodium salt SMR000326870 sodium;9-[(4aR,6R,7R,7aS)-2-oxidanidyl-7-oxidanyl-2-oxidanylidene-4a,6,7,7a-tetrahydro-4H-furo[3,2-d][1,3,2]dioxaphosphinin-6-yl]-2-azanyl-8-bromanyl-3H-purin-6-one sodium;9-[(4aR,6R,7R,7aS)-7-hydroxy-2-oxido-2-oxo-4a,6,7,7a-tetrahydro-4H-furo[3,2-d][1,3,2]dioxaphosphinin-6-yl]-2-amino-8-bromo-3H-purin-6-one | sodium;9-[(4aR,6R,7R,7aS)-7-hydroxy-2-oxido-2-oxo-4a,6,7,7a-tetrahydro-4H-furo[3,2-d][1,3,2]dioxaphosphorin-6-yl]-2-amino-8-bromo-3H-purin-6-one
Type:
Small organic molecule
Emp. Form.:
C10H10BrN5O7P
Mol. Mass.:
423.094
SMILES:
Nc1nc2n([C@@H]3O[C@@H]4COP([O-])(=O)O[C@H]4[C@H]3O)c(Br)nc2c(=O)[nH]1
: