Target
Hypoxia-inducible factor 1-alpha
Ligand
BDBM81381
Substrate
Meas. Tech.
Enzyme Inhibition Assay
IC50
1.0e+4± 1e+3 nM
Citation
 Smirnova, NARakhman, IMoroz, NBasso, MPayappilly, JKazakov, SHernandez-Guzman, FGaisina, INKozikowski, APRatan, RRGazaryan, IG Utilization of an in vivo reporter for high throughput identification of branched small molecule regulators of hypoxic adaptation. Chem Biol 17:380-91 (2010)  
Target
Name:
Hypoxia-inducible factor 1-alpha
Synonyms:
BHLHE78 HIF-1-alpha, HIF-2-alpha HIF1A_HUMAN Hypoxia-inducible factor 1 alpha MOP1 von Hippel-Lindau disease tumor suppressor/Elongin-C/Elongin-B/HIF1A
Type:
Protein
Mol. Mass.:
92647.24
Organism:
Homo sapiens (Human)
Description:
Q16665
Residue:
826
  
Inhibitor
Name:
BDBM81381
Synonyms:
Oxyquinoline, D2, #9
Type:
Small organic molecule
Emp. Form.:
C21H18N4O
Mol. Mass.:
342.3938
SMILES:
Cc1ccc2ccc(C(Nc3ccccn3)c3cccnc3)c(O)c2n1
: