Target
Hypoxia-inducible factor 1-alpha
Ligand
BDBM52237
Substrate
Meas. Tech.
Enzyme Inhibition Assay
IC50
7e+3± 2e+2 nM
Citation
 Smirnova, NARakhman, IMoroz, NBasso, MPayappilly, JKazakov, SHernandez-Guzman, FGaisina, INKozikowski, APRatan, RRGazaryan, IG Utilization of an in vivo reporter for high throughput identification of branched small molecule regulators of hypoxic adaptation. Chem Biol 17:380-91 (2010)  
Target
Name:
Hypoxia-inducible factor 1-alpha
Synonyms:
BHLHE78 HIF-1-alpha, HIF-2-alpha HIF1A_HUMAN Hypoxia-inducible factor 1 alpha MOP1 von Hippel-Lindau disease tumor suppressor/Elongin-C/Elongin-B/HIF1A
Type:
Protein
Mol. Mass.:
92647.24
Organism:
Homo sapiens (Human)
Description:
Q16665
Residue:
826
  
Inhibitor
Name:
BDBM52237
Synonyms:
2-methyl-7-[phenyl-(2-pyridinylamino)methyl]-8-quinolinol 2-methyl-7-[phenyl-(pyridin-2-ylamino)methyl]quinolin-8-ol Oxyquinoline, D2, #5 cid_4999481
Type:
Small organic molecule
Emp. Form.:
C22H19N3O
Mol. Mass.:
341.4058
SMILES:
Cc1ccc2ccc(C(Nc3ccccn3)c3ccccc3)c(O)c2n1
: