Target
Alpha-1A adrenergic receptor
Ligand
BDBM29135
Substrate
Ki
5900±n/a nM
Comments
PDSP_20672
Citation
 U'Prichard, DCGreenberg, DASnyder, SH Binding characteristics of a radiolabeled agonist and antagonist at central nervous system alpha noradrenergic receptors. Mol Pharmacol 13:454-73 (1977) Target
Name:
Alpha-1A adrenergic receptor
Synonyms:
ADA1A_RAT Adra1c Alpha-1A adrenoceptor Alpha-1C adrenergic receptor | adrenergic Alpha1A
Type:
Protein
Mol. Mass.:
51620.15
Organism:
Rattus norvegicus (Rat)
Description:
P43140
Residue:
466
  
Inhibitor
Name:
BDBM29135
Synonyms:
CHEMBL11608 p-Tyramine | tyramine
Type:
Small organic molecule
Emp. Form.:
C8H11NO
Mol. Mass.:
137.179
SMILES:
NCCc1ccc(O)cc1
: