Target
Endochitinase A1
Ligand
BDBM81344
Substrate
Meas. Tech.
Enzyme Inhibition Assay
pH
5.5±0
Temperature
310.15±0 K
IC50
7.9e+4± 8e+3 nM
Citation
 Rush, CLSchüttelkopf, AWHurtado-Guerrero, RBlair, DEIbrahim, AFDesvergnes, SEggleston, IMvan Aalten, DM Natural product-guided discovery of a fungal chitinase inhibitor. Chem Biol 17:1275-81 (2010)  
Target
Name:
Endochitinase A1
Synonyms:
CHIA1_ASPFM chi1 | chiA1
Type:
Enzyme
Mol. Mass.:
83057.83
Organism:
Neosartorya fumigata (Aspergillus fumigatus)
Description:
Q873Y0
Residue:
825
  
Inhibitor
Name:
BDBM81344
Synonyms:
Argifin-Derived Fragments, 1 | Dimethylguanylurea
Type:
Small organic molecule
Emp. Form.:
C4H10N4O
Mol. Mass.:
130.1484
SMILES:
CNC(=O)NC(N)=NC
: