Target
5-hydroxytryptamine receptor 2A
Ligand
BDBM50001775
Substrate
Ki
3.8±n/a nM
Comments
PDSP_1602
Citation
 Roth, BLCiaranello, RDMeltzer, HY Binding of typical and atypical antipsychotic agents to transiently expressed 5-HT1C receptors. J Pharmacol Exp Ther 260:1361-5 (1992) Target
Name:
5-hydroxytryptamine receptor 2A
Synonyms:
5-HT-2A 5-HT2A 5-hydroxytryptamine receptor 2A (5HT2A) Htr2 Serotonin Receptor 2A
Type:
G Protein-Coupled Receptor (GPCR)
Mol. Mass.:
52852.05
Organism:
Rattus norvegicus (rat)
Description:
Rat cortex membranes 5-HT2A receptors.
Residue:
471
  
Inhibitor
Name:
BDBM50001775
Synonyms:
(ritanserin)6-(2-{4-[Bis-(4-fluoro-phenyl)-methylene]-piperidin-1-yl}-ethyl)-7-methyl-2,3-dihydro-1H-indolizin-5-one 6-(2-(4-(bis(4-fluorophenyl)methylene)piperidin-1-yl)ethyl)-7-methyl-5H-thiazolo[3,2-a]pyrimidin-5-one 6-(2-{4-[Bis-(4-fluoro-phenyl)-methylene]-piperidin-1-yl}-ethyl)-7-methyl-thiazolo[3,2-a]pyrimidin-5-one 6-(2-{4-[Bis-(4-fluoro-phenyl)-methylene]-piperidin-1-yl}-ethyl)-7-methyl-thiazolo[3,2-a]pyrimidin-5-one(Ritanserin) RITANSERIN cid_5074
Type:
Small organic molecule
Emp. Form.:
C27H25F2N3OS
Mol. Mass.:
477.569
SMILES:
[#6]-c1nc2sccn2c(=O)c1-[#6]-[#6]-[#7]-1-[#6]-[#6]\[#6](-[#6]-[#6]-1)=[#6](\c1ccc(F)cc1)-c1ccc(F)cc1
: