Target
Alpha-2C adrenergic receptor
Ligand
BDBM50020192
Substrate
Ki
0.26±n/a nM
Comments
PDSP_1743
Citation
 Bylund, DBBlaxall, HSIversen, LJCaron, MGLefkowitz, RJLomasney, JW Pharmacological characteristics of alpha 2-adrenergic receptors: comparison of pharmacologically defined subtypes with subtypes identified by molecular cloning. Mol Pharmacol 42:1-5 (1992) Target
Name:
Alpha-2C adrenergic receptor
Synonyms:
ADRA2C | adrenergic Alpha2C
Type:
Enzyme Catalytic Domain
Mol. Mass.:
27257.01
Organism:
OK
Description:
adrenergic Alpha2C ADRA2C OK::G3GWB4
Residue:
230
  
Inhibitor
Name:
BDBM50020192
Synonyms:
8-(2,3-Dihydro-benzo[1,4]dioxin-2-ylmethyl)-1-phenyl-1,3,8-triaza-spiro[4.5]decan-4-one Spiroxatrine
Type:
Small organic molecule
Emp. Form.:
C22H25N3O3
Mol. Mass.:
379.4522
SMILES:
O=C1NCN(c2ccccc2)C11CCN(CC2COc3ccccc3O2)CC1
: