Target
Alpha-2C adrenergic receptor
Ligand
BDBM81815
Substrate
Ki
0.14±n/a nM
Comments
PDSP_1049
Citation
 Blaxall, HSMurphy, TJBaker, JCRay, CBylund, DB Characterization of the alpha-2C adrenergic receptor subtype in the opossum kidney and in the OK cell line. J Pharmacol Exp Ther 259:323-9 (1991) Target
Name:
Alpha-2C adrenergic receptor
Synonyms:
ADRA2C | adrenergic Alpha2C
Type:
Enzyme Catalytic Domain
Mol. Mass.:
27257.01
Organism:
OK
Description:
adrenergic Alpha2C ADRA2C OK::G3GWB4
Residue:
230
  
Inhibitor
Name:
BDBM81815
Synonyms:
CAS_196343 NSC_196343
Type:
Small organic molecule
Emp. Form.:
C46H67N9O9S2
Mol. Mass.:
954.209
SMILES:
CCOc1ccc(CC(NC(=O)CC2(S)CCCCC2)C(=O)NC(Cc2ccccc2)C(=O)NC(C(C)C)C(=O)NC(CC(N)=O)C(=O)NC(C=S)C(=O)NC(CCCCN)C(N)=O)cc1
: