Target
Alpha-2C adrenergic receptor
Ligand
BDBM50013515
Substrate
Ki
0.4±n/a nM
Comments
PDSP_1987
Citation
 Blaxall, HSMurphy, TJBaker, JCRay, CBylund, DB Characterization of the alpha-2C adrenergic receptor subtype in the opossum kidney and in the OK cell line. J Pharmacol Exp Ther 259:323-9 (1991) Target
Name:
Alpha-2C adrenergic receptor
Synonyms:
ADA2C_DIDVI Alpha-2C adrenergic receptor | adrenergic Alpha2C
Type:
Enzyme Catalytic Domain
Mol. Mass.:
53254.77
Organism:
OPOSSUM
Description:
adrenergic Alpha2C ADRA2C OPOSSUM::P35405
Residue:
469
  
Inhibitor
Name:
BDBM50013515
Synonyms:
(+)-yohimbine 17alpha-hydroxyyohimban-16alpha-carboxylic acid methyl ester CORYNANTHINE Quebrachin YOHIMBINE CHLORIDE Yohimbine cid_8969 methyl 17alpha-hydroxyyohimban-16alpha-carboxylate yohimbic acid methyl ester
Type:
Small organic molecule
Emp. Form.:
C21H26N2O3
Mol. Mass.:
354.4427
SMILES:
COC(=O)[C@H]1[C@@H](O)CC[C@H]2CN3CCc4c([nH]c5ccccc45)[C@@H]3C[C@H]12
: