Target
Muscarinic acetylcholine receptor M1
Ligand
BDBM48918
Substrate
Ki
23±n/a nM
Comments
PDSP_1211
Citation
 Mei, LLai, JYamamura, HIRoeske, WR Pharmacologic comparison of selected agonists for the M1 muscarinic receptor in transfected murine fibroblast cells (B82). J Pharmacol Exp Ther 256:689-94 (1991) Target
Name:
Muscarinic acetylcholine receptor M1
Synonyms:
ACM1_HUMAN Cholinergic receptor, muscarinic 1 | Cholinergic, muscarinic M1
Type:
Protein
Mol. Mass.:
51442.54
Organism:
Homo sapiens (Human)
Description:
P11229
Residue:
460
  
Inhibitor
Name:
BDBM48918
Synonyms:
2-acetoxypropyl(trimethyl)ammonium;chloride 2-acetyloxypropyl(trimethyl)azanium;chloride METHACHOLINE CHLORIDE SMR000059224 | cid_6114
Type:
Small organic molecule
Emp. Form.:
C8H18NO2
Mol. Mass.:
160.2335
SMILES:
CC(C[N+](C)(C)C)OC(C)=O
: