Target
Gastrin/cholecystokinin type B receptor
Ligand
BDBM81870
Substrate
Ki
4.9±n/a nM
Comments
PDSP_2193
Citation
 Lin, CWShiosaki, KMiller, TRWitte, DGBianchi, BRWolfram, CAKopecka, HCraig, RWagenaar, FNadzan, AM Characterization of two novel cholecystokinin tetrapeptide (30-33) analogues, A-71623 and A-70874, that exhibit high potency and selectivity for cholecystokinin-A receptors. Mol Pharmacol 39:346-51 (1991) Target
Name:
Gastrin/cholecystokinin type B receptor
Synonyms:
CCKBR | Cholecystokinin A
Type:
Enzyme Catalytic Domain
Mol. Mass.:
48683.10
Organism:
GUINEA PIG
Description:
Cholecystokinin A CCKBR GUINEA PIG::H0VZC5
Residue:
450
  
Inhibitor
Name:
BDBM81870
Synonyms:
A-70874 NSC_6439313
Type:
Small organic molecule
Emp. Form.:
C45H55N7O10
Mol. Mass.:
853.9591
SMILES:
CNC(Cc1ccccc1)C(=O)N(C(=O)C(CC(O)=O)NC(=O)C(N)CCCCNC(=O)C=Cc1ccc(O)cc1)C(=O)C(Cc1c[nH]c2ccccc12)NC(=O)OC(C)(C)C
: