Target
Dopamine receptor D4
Ligand
BDBM50001955
Substrate
Ki
2±n/a nM
Comments
PDSP_324
Citation
 Van Tol, HHBunzow, JRGuan, HCSunahara, RKSeeman, PNiznik, HBCivelli, O Cloning of the gene for a human dopamine D4 receptor with high affinity for the antipsychotic clozapine. Nature 350:610-4 (1991)  
Target
Name:
Dopamine receptor D4
Synonyms:
DOPAMINE D2 Long DRD2 | Dopamine receptor D4
Type:
Enzyme Catalytic Domain
Mol. Mass.:
43731.97
Organism:
CANINE
Description:
Q589Y6
Residue:
421
  
Inhibitor
Name:
BDBM50001955
Synonyms:
(-)6-Methyl-5,6,6a,7-tetrahydro-4H-dibenzo[de,g]quinoline-10,11-diol(APO) (R)-6-Methyl-5,6,6a,7-tetrahydro-4H-dibenzo[de,g]quinoline-10,11-diol ((R)-apomorphine) (R)-6-Methyl-5,6,6a,7-tetrahydro-4H-dibenzo[de,g]quinoline-10,11-diol(apomorphine) 6-Methyl-5,6,6a,7-tetrahydro-4H-dibenzo[de,g]quinoline-10,11-diol 6-Methyl-5,6,6a,7-tetrahydro-4H-dibenzo[de,g]quinoline-10,11-diol((R)-apomorphine) APOMORPHINE APOMORPHINE6-Methyl-5,6,6a,7-tetrahydro-4H-dibenzo[de,g]quinoline-10,11-diol | CHEMBL53
Type:
Small organic molecule
Emp. Form.:
C17H17NO2
Mol. Mass.:
267.3224
SMILES:
CN1CCc2cccc-3c2[C@H]1Cc1ccc(O)c(O)c-31
: