Target
Beta-1 adrenergic receptor
Ligand
BDBM25762
Substrate
Ki
2238.72±n/a nM
Comments
PDSP_6656
Citation
 Tsuchihashi, HNakashima, YKinami, JNagatomo, T Characteristics of 125I-iodocyanopindolol binding to beta-adrenergic and serotonin-1B receptors of rat brain: selectivity of beta-adrenergic agents. Jpn J Pharmacol 52:195-200 (1990)  
Target
Name:
Beta-1 adrenergic receptor
Synonyms:
ADRB1R, B1AR Adrb1 Adrenergic receptor beta Beta-1 adrenoreceptor adrenergic Beta1,2
Type:
Protein
Mol. Mass.:
50486.84
Organism:
Rattus norvegicus (Rat)
Description:
P18090
Residue:
466
  
Inhibitor
Name:
BDBM25762
Synonyms:
CHEMBL471 SOTALOL HYDROCHLORIDE Sotalol,(+) cid_66245
Type:
Small organic molecule
Emp. Form.:
C12H20N2O3S
Mol. Mass.:
272.364
SMILES:
CC(C)NCC(O)c1ccc(NS(C)(=O)=O)cc1
: