Target
Muscarinic acetylcholine receptor M3
Ligand
BDBM81462
Substrate
Ki
2.45±n/a nM
Comments
PDSP_2389
Citation
 Dörje, FWess, JLambrecht, GTacke, RMutschler, EBrann, MR Antagonist binding profiles of five cloned human muscarinic receptor subtypes. J Pharmacol Exp Ther 256:727-33 (1991) Target
Name:
Muscarinic acetylcholine receptor M3
Synonyms:
ACM3_HUMAN Cholinergic, muscarinic M3 Muscarinic receptor M3 | RecName: Full=Muscarinic acetylcholine receptor M3
Type:
Enzyme
Mol. Mass.:
66151.03
Organism:
Homo sapiens (Human)
Description:
P20309
Residue:
590
  
Inhibitor
Name:
BDBM81462
Synonyms:
(R)-Trihexyphenidyl Benzhexol NSC_5572 Trihexyphenidyl
Type:
Small organic molecule
Emp. Form.:
C20H31NO
Mol. Mass.:
301.4662
SMILES:
OC(CCN1CCCCC1)(C1CCCCC1)c1ccccc1
: